Problème de compilation

Bonjour, j’ai une erreur lors du make que je ne comprends pas. J’ai suivi à la lettre les instructions du tutoriel d’installation de TC pour Linux sur le wiki.


funky@SRV-NLC:~/build$ cmake ../TrinityCore/ -DPREFIX=/opt/Windrunner

-- The C compiler identification is GNU

-- The CXX compiler identification is GNU

-- Check for working C compiler: /usr/bin/gcc

-- Check for working C compiler: /usr/bin/gcc -- works

-- Detecting C compiler ABI info

-- Detecting C compiler ABI info - done

-- Check for working CXX compiler: /usr/bin/c++

-- Check for working CXX compiler: /usr/bin/c++ -- works

-- Detecting CXX compiler ABI info

-- Detecting CXX compiler ABI info - done

-- Detected 32-bit platform

-- UNIX: Using default configuration directory

-- UNIX: Using default library directory

-- UNIX: Configuring uninstall target

-- UNIX: Created uninstall target

-- GCC: SSE2 flags forced

-- GCC: All warnings disabled

-- Found ACE library: /usr/local/lib/libACE.so

-- Found ACE headers: /usr/local/include

-- Found OpenSSL: /usr/lib/libssl.so;/usr/lib/libcrypto.so

-- Using mysql-config: /usr/bin/mysql_config

-- Found MySQL library: /usr/lib/libmysqlclient_r.so

-- Found MySQL headers: /usr/include/mysql

-- Found Readline library: /usr/lib/libreadline.so

-- Include dir is: /usr/include

-- Found ZLIB: /usr/include

-- Found BZip2: /usr/lib/libbz2.so

-- Looking for BZ2_bzCompressInit in /usr/lib/libbz2.so

-- Looking for BZ2_bzCompressInit in /usr/lib/libbz2.so - found

* TrinityCore rev. hash : 5a99dfad1492

* TrinityCore rev. date : 2012-07-30 10:07:26 +0200

* TrinityCore buildtype : Release

* Install core to	 : /opt/Windrunner

* Install libraries to : /opt/Windrunner/lib

* Install configs to	 : /opt/Windrunner/etc

* Build world/auth	 : Yes (default)

* Build with scripts	 : Yes (default)

* Build map/vmap tools : No (default)

* Build core w/PCH	 : Yes (default)

* Build scripts w/PCH : Yes (default)

* Show compile-warnings : No (default)

* Use coreside debug	 : No (default)

-- SCRIPT PREPARATIONS

-> Prepared: Spells

-> Prepared: Commands

-> Prepared: Examples

-> Prepared: Custom

-> Prepared: World

-> Prepared: Outdoor PVP Zones

-> Prepared: Eastern Kingdoms

-> Prepared: Kalimdor

-> Prepared: Outland

-> Prepared: Northrend

-- SCRIPT PREPARATION COMPLETE

-- Configuring done

-- Generating done

-- Build files have been written to: /home/funky/build

funky@SRV-NLC:~/build$ make

Scanning dependencies of target jemalloc

[ 0%] Building C object dep/jemalloc/CMakeFiles/jemalloc.dir/src/tcache.c.o

In file included from /usr/include/sys/param.h:28,

				 from /home/funky/TrinityCore/dep/jemalloc/include/jemalloc/internal/jemalloc_internal.h:2,

				 from /home/funky/TrinityCore/dep/jemalloc/src/tcache.c:2:

/usr/include/linux/param.h:4:23: error: asm/param.h: Aucun fichier ou dossier de ce type

In file included from /usr/include/bits/errno.h:25,

				 from /usr/include/errno.h:36,

				 from /home/funky/TrinityCore/dep/jemalloc/include/jemalloc/internal/jemalloc_internal.h:8,

				 from /home/funky/TrinityCore/dep/jemalloc/src/tcache.c:2:

/usr/include/linux/errno.h:4:23: error: asm/errno.h: Aucun fichier ou dossier de ce type

make[2]: *** [dep/jemalloc/CMakeFiles/jemalloc.dir/src/tcache.c.o] Erreur 1

make[1]: *** [dep/jemalloc/CMakeFiles/jemalloc.dir/all] Erreur 2

make: *** [all] Erreur 2

Merci d’avance pour vos réponses /emoticons/default_smile.png

Est-ce que tu a une source propre ?

PS : J’ai TC sur Windows, donc je n’y connait pas grand chose dans Linux…

Excusez moi du retard, j’ai téléchargé la derière version sur Git donc j’espère quand même qu’on peut considérer ça comme une source propre ^^

J’ao également installé ACE et openssl 0.9.8 comme demandé dans le tuto sur le wiki.

Bonjour,

J’ai commencer a compiler un core 3.3.5 Trinity , tout a bien fonctionné ( cmake, récupération des sources )

Et la compilation ne marche pas, voila mon erreur :

1>------ Début de la génération : Projet : ZERO_CHECK, Configuration : Release Win32 ------

1> Checking Build System
1>CUSTOMBUILD : CMake error : Cannot restore timestamp C:/build/CMakeFiles/generate.stamp
1> – Detected 32-bit platform
1> – Using supplied MySQL sources
1> – MSVC: Enabled large address awareness
1> – MSVC: Enabled SSE2 support
1> – MSVC: Overloaded standard names
1> – MSVC: Disabled NON-SECURE warnings
1> – MSVC: Disabled POSIX warnings
1> – MSVC: Disabled generic compiletime warnings
1> – Found OpenSSL library: optimized;C:/OpenSSL-Win32/lib/VC/ssleay32MD.lib;C:/OpenSSL-Win32/lib/VC/libeay32MD.lib;debug;C:/OpenSSL-Win32/lib/VC/ssleay32MDd.lib;C:/OpenSSL-Win32/lib/VC/libeay32MDd.lib
1> – Found OpenSSL headers: C:/OpenSSL-Win32/include
1>
1> * TrinityCore revision : unknown 1970-01-01 00:00:00 +0000 (Archived branch)
1>
1> * Install core to : C:/Program Files (x86)/TrinityCore
1>
1> * Build world/auth : Yes (default)
1> * Build with scripts : Yes (default)
1> * Build map/vmap tools : No (default)
1> * Build core w/PCH : Yes (default)
1> * Build scripts w/PCH : Yes (default)
1> * Show compile-warnings : No (default)
1> * Use coreside debug : Yes
1> * Use MySQL sourcetree : Yes (default)
1> * Use GIT revision hash : No
1>
1> *** WITHOUT_GIT - WARNING!
1> *** By choosing the WITHOUT_GIT option you have waived all rights for support,
1> *** and accept that or all requests for support or assistance sent to the core
1> *** developers will be rejected. This due to that we will be unable to detect
1> *** what revision of the codebase you are using in a proper way.
1> *** We remind you that you need to use the repository codebase and a supported
1> *** version of git for the revision-hash to work, and be allowede to ask for
1> *** support if needed.
1>
1> – MySQL 5.5.9
1> – SCRIPT PREPARATIONS
1> → Prepared: Spells
1> → Prepared: Commands
1> → Prepared: Examples
1> → Prepared: Custom
1> → Prepared: World
1> → Prepared: Outdoor PVP Zones
1> → Prepared: Eastern Kingdoms
1> → Prepared: Kalimdor
1> → Prepared: Outland
1> → Prepared: Northrend
1> → Prepared: Events
1> → Prepared: Pet
1> – SCRIPT PREPARATION COMPLETE
1>
1> – Configuring incomplete, errors occurred!
1> See also “C:/build/CMakeFiles/CMakeOutput.log”.
1> See also “C:/build/CMakeFiles/CMakeError.log”.
1>CUSTOMBUILD : CMake error : Unable to open check cache file for write. C:/build/CMakeFiles/cmake.check_cache
1> CMake Configure step failed. Build files cannot be regenerated correctly. Attempting to stop IDE build.
2>------ Début de la génération : Projet : ace, Configuration : Release Win32 ------
3>------ Début de la génération : Projet : zlib, Configuration : Release Win32 ------
4>------ Début de la génération : Projet : revision.h, Configuration : Release Win32 ------
5>------ Début de la génération : Projet : gsoap, Configuration : Release Win32 ------
2> Building Custom Rule C:/Trinity/dep/acelite/ace/CMakeLists.txt
3> Building Custom Rule C:/Trinity/dep/zlib/CMakeLists.txt
5> Building Custom Rule C:/Trinity/dep/gsoap/CMakeLists.txt
4> Building Custom Rule C:/Trinity/src/genrev/CMakeLists.txt
3>CUSTOMBUILD : CMake error : Cannot restore timestamp C:builddepzlibCMakeFilesgenerate.stamp
2>CUSTOMBUILD : CMake error : Cannot restore timestamp C:builddepaceliteaceCMakeFilesgenerate.stamp
4>CUSTOMBUILD : CMake error : Cannot restore timestamp C:buildsrcgenrevCMakeFilesgenerate.stamp
5>CUSTOMBUILD : CMake error : Cannot restore timestamp C:builddepgsoapCMakeFilesgenerate.stamp
3> – Detected 32-bit platform
3> – Using supplied MySQL sources
3> – MSVC: Enabled large address awareness
3> – MSVC: Enabled SSE2 support
3> – MSVC: Overloaded standard names
3> – MSVC: Disabled NON-SECURE warnings
3> – MSVC: Disabled POSIX warnings
3> – MSVC: Disabled generic compiletime warnings
3> – Found OpenSSL library: optimized;C:/OpenSSL-Win32/lib/VC/ssleay32MD.lib;C:/OpenSSL-Win32/lib/VC/libeay32MD.lib;debug;C:/OpenSSL-Win32/lib/VC/ssleay32MDd.lib;C:/OpenSSL-Win32/lib/VC/libeay32MDd.lib
3> – Found OpenSSL headers: C:/OpenSSL-Win32/include
3>
5> – Detected 32-bit platform
4> – Detected 32-bit platform
4> – Using supplied MySQL sources
4> – MSVC: Enabled large address awareness
4> – MSVC: Enabled SSE2 support
4> – MSVC: Overloaded standard names
4> – MSVC: Disabled NON-SECURE warnings
4> – MSVC: Disabled POSIX warnings
4> – MSVC: Disabled generic compiletime warnings
4> – Found OpenSSL library: optimized;C:/OpenSSL-Win32/lib/VC/ssleay32MD.lib;C:/OpenSSL-Win32/lib/VC/libeay32MD.lib;debug;C:/OpenSSL-Win32/lib/VC/ssleay32MDd.lib;C:/OpenSSL-Win32/lib/VC/libeay32MDd.lib
4> – Found OpenSSL headers: C:/OpenSSL-Win32/include
3> * TrinityCore revision : unknown 1970-01-01 00:00:00 +0000 (Archived branch)
4>
2> – Detected 32-bit platform
5> – Using supplied MySQL sources
4> * TrinityCore revision : unknown 1970-01-01 00:00:00 +0000 (Archived branch)
4>
4> * Install core to : C:/Program Files (x86)/TrinityCore
4>
4> * Build world/auth : Yes (default)
4> * Build with scripts : Yes (default)
4> * Build map/vmap tools : No (default)
4> * Build core w/PCH : Yes (default)
4> * Build scripts w/PCH : Yes (default)
4> * Show compile-warnings : No (default)
4> * Use coreside debug : Yes
4> * Use MySQL sourcetree : Yes (default)
4> * Use GIT revision hash : No
4>
4> *** WITHOUT_GIT - WARNING!
4> *** By choosing the WITHOUT_GIT option you have waived all rights for support,
4> *** and accept that or all requests for support or assistance sent to the core
4> *** developers will be rejected. This due to that we will be unable to detect
4> *** what revision of the codebase you are using in a proper way.
4> *** We remind you that you need to use the repository codebase and a supported
4> *** version of git for the revision-hash to work, and be allowede to ask for
4> *** support if needed.
4>
2> – Using supplied MySQL sources
3>
5> – MSVC: Enabled large address awareness
4> – MySQL 5.5.9
3> * Install core to : C:/Program Files (x86)/TrinityCore
3>
3> * Build world/auth : Yes (default)
2> – MSVC: Enabled large address awareness
5> – MSVC: Enabled SSE2 support
5> – MSVC: Overloaded standard names
2> – MSVC: Enabled SSE2 support
5> – MSVC: Disabled NON-SECURE warnings
3> * Build with scripts : Yes (default)
3> * Build map/vmap tools : No (default)
5> – MSVC: Disabled POSIX warnings
5> – MSVC: Disabled generic compiletime warnings
5> – Found OpenSSL library: optimized;C:/OpenSSL-Win32/lib/VC/ssleay32MD.lib;C:/OpenSSL-Win32/lib/VC/libeay32MD.lib;debug;C:/OpenSSL-Win32/lib/VC/ssleay32MDd.lib;C:/OpenSSL-Win32/lib/VC/libeay32MDd.lib
5> – Found OpenSSL headers: C:/OpenSSL-Win32/include
5>
5> * TrinityCore revision : unknown 1970-01-01 00:00:00 +0000 (Archived branch)
5>
5> * Install core to : C:/Program Files (x86)/TrinityCore
5>
5> * Build world/auth : Yes (default)
5> * Build with scripts : Yes (default)
5> * Build map/vmap tools : No (default)
5> * Build core w/PCH : Yes (default)
2> – MSVC: Overloaded standard names
2> – MSVC: Disabled NON-SECURE warnings
2> – MSVC: Disabled POSIX warnings
2> – MSVC: Disabled generic compiletime warnings
2> – Found OpenSSL library: optimized;C:/OpenSSL-Win32/lib/VC/ssleay32MD.lib;C:/OpenSSL-Win32/lib/VC/libeay32MD.lib;debug;C:/OpenSSL-Win32/lib/VC/ssleay32MDd.lib;C:/OpenSSL-Win32/lib/VC/libeay32MDd.lib
2> – Found OpenSSL headers: C:/OpenSSL-Win32/include
2>
2> * TrinityCore revision : unknown 1970-01-01 00:00:00 +0000 (Archived branch)
2>
2> * Install core to : C:/Program Files (x86)/TrinityCore
2>
2> * Build world/auth : Yes (default)
2> * Build with scripts : Yes (default)
2> * Build map/vmap tools : No (default)
2> * Build core w/PCH : Yes (default)
2> * Build scripts w/PCH : Yes (default)
2> * Show compile-warnings : No (default)
5> * Build scripts w/PCH : Yes (default)
3> * Build core w/PCH : Yes (default)
3> * Build scripts w/PCH : Yes (default)
3> * Show compile-warnings : No (default)
3> * Use coreside debug : Yes
3> * Use MySQL sourcetree : Yes (default)
3> * Use GIT revision hash : No
3>
5> * Show compile-warnings : No (default)
3> *** WITHOUT_GIT - WARNING!
5> * Use coreside debug : Yes
5> * Use MySQL sourcetree : Yes (default)
5> * Use GIT revision hash : No
5>
5> *** WITHOUT_GIT - WARNING!
5> *** By choosing the WITHOUT_GIT option you have waived all rights for support,
5> *** and accept that or all requests for support or assistance sent to the core
5> *** developers will be rejected. This due to that we will be unable to detect
5> *** what revision of the codebase you are using in a proper way.
5> *** We remind you that you need to use the repository codebase and a supported
5> *** version of git for the revision-hash to work, and be allowede to ask for
5> *** support if needed.
5>
5> – MySQL 5.5.9
2> * Use coreside debug : Yes
3> *** By choosing the WITHOUT_GIT option you have waived all rights for support,
2> * Use MySQL sourcetree : Yes (default)
3> *** and accept that or all requests for support or assistance sent to the core
3> *** developers will be rejected. This due to that we will be unable to detect
4> – SCRIPT PREPARATIONS
2> * Use GIT revision hash : No
5> – SCRIPT PREPARATIONS
4> → Prepared: Spells
3> *** what revision of the codebase you are using in a proper way.
5> → Prepared: Spells
5> → Prepared: Commands
5> → Prepared: Examples
5> → Prepared: Custom
5> → Prepared: World
5> → Prepared: Outdoor PVP Zones
2>
5> → Prepared: Eastern Kingdoms
5> → Prepared: Kalimdor
2> *** WITHOUT_GIT - WARNING!
5> → Prepared: Outland
2> *** By choosing the WITHOUT_GIT option you have waived all rights for support,
2> *** and accept that or all requests for support or assistance sent to the core
2> *** developers will be rejected. This due to that we will be unable to detect
5> → Prepared: Northrend
5> → Prepared: Events
5> → Prepared: Pet
5>
5> – SCRIPT PREPARATION COMPLETE
5>CUSTOMBUILD : CMake error : Unable to open check cache file for write. C:/build/CMakeFiles/cmake.check_cache
5> – Configuring incomplete, errors occurred!
3> *** We remind you that you need to use the repository codebase and a supported
4> → Prepared: Commands
4> → Prepared: Examples
4> → Prepared: Custom
4> → Prepared: World
4> → Prepared: Outdoor PVP Zones
4> → Prepared: Eastern Kingdoms
4> → Prepared: Kalimdor
4> → Prepared: Outland
4> → Prepared: Northrend
4> → Prepared: Events
4> → Prepared: Pet
4> – SCRIPT PREPARATION COMPLETE
4>
4> – Configuring incomplete, errors occurred!
4> See also “C:/build/CMakeFiles/CMakeOutput.log”.
4> See also “C:/build/CMakeFiles/CMakeError.log”.
4>CUSTOMBUILD : CMake error : Unable to open check cache file for write. C:/build/CMakeFiles/cmake.check_cache
3> *** version of git for the revision-hash to work, and be allowede to ask for
3> *** support if needed.
3>
3> – MySQL 5.5.9
3> CMake Error at dep/mysqllite/CMakeLists.txt:254 (configure_file):
3> configure_file Problem configuring file
3>
3>
3> – SCRIPT PREPARATIONS
3> → Prepared: Spells
3> – SCRIPT PREPARATION COMPLETE
3> → Prepared: Commands
3> → Prepared: Examples
3> → Prepared: Custom
3> → Prepared: World
3> → Prepared: Outdoor PVP Zones
3> → Prepared: Eastern Kingdoms
3> → Prepared: Kalimdor
3> → Prepared: Outland
3> → Prepared: Northrend
3> → Prepared: Events
3> → Prepared: Pet
3>
3> – Configuring incomplete, errors occurred!
3> See also “C:/build/CMakeFiles/CMakeOutput.log”.
3> See also “C:/build/CMakeFiles/CMakeError.log”.
3>CUSTOMBUILD : CMake error : Unable to open check cache file for write. C:/build/CMakeFiles/cmake.check_cache
6>------ Début de la génération : Projet : scripts, Configuration : Release Win32 ------
5> See also “C:/build/CMakeFiles/CMakeOutput.log”.
5> See also “C:/build/CMakeFiles/CMakeError.log”.
7>------ Début de la génération : Projet : game, Configuration : Release Win32 ------
2> *** what revision of the codebase you are using in a proper way.
2> *** We remind you that you need to use the repository codebase and a supported
2> *** version of git for the revision-hash to work, and be allowede to ask for
2> *** support if needed.
2>
2> – MySQL 5.5.9
2> CMake Error at dep/mysqllite/CMakeLists.txt:254 (configure_file):
2> configure_file Problem configuring file
2>
2>
2> – SCRIPT PREPARATIONS
2> → Prepared: Spells
2> → Prepared: Commands
2> → Prepared: Examples
2> → Prepared: Custom
2> → Prepared: World
2> → Prepared: Outdoor PVP Zones
2> → Prepared: Eastern Kingdoms
2> – SCRIPT PREPARATION COMPLETE
2> → Prepared: Kalimdor
2> → Prepared: Outland
2> → Prepared: Northrend
2> → Prepared: Events
2> → Prepared: Pet
2>
2> – Configuring incomplete, errors occurred!
2> See also “C:/build/CMakeFiles/CMakeOutput.log”.
2> See also “C:/build/CMakeFiles/CMakeError.log”.
2>CUSTOMBUILD : CMake error : Unable to open check cache file for write. C:/build/CMakeFiles/cmake.check_cache
8>------ Début de la génération : Projet : g3dlib, Configuration : Release Win32 ------
9>------ Début de la génération : Projet : shared, Configuration : Release Win32 ------
6> Building Custom Rule C:/Trinity/src/server/scripts/CMakeLists.txt
7> Building Custom Rule C:/Trinity/src/server/game/CMakeLists.txt
8> Building Custom Rule C:/Trinity/dep/g3dlite/CMakeLists.txt
9> Building Custom Rule C:/Trinity/src/server/shared/CMakeLists.txt
6>CUSTOMBUILD : CMake error : Cannot restore timestamp C:buildsrcserverscriptsCMakeFilesgenerate.stamp
6> – Detected 32-bit platform
6> – Using supplied MySQL sources
6> – MSVC: Enabled large address awareness
6> – MSVC: Enabled SSE2 support
6> – MSVC: Overloaded standard names
6> – MSVC: Disabled NON-SECURE warnings
6> – MSVC: Disabled POSIX warnings
6> – MSVC: Disabled generic compiletime warnings
6> – Found OpenSSL library: optimized;C:/OpenSSL-Win32/lib/VC/ssleay32MD.lib;C:/OpenSSL-Win32/lib/VC/libeay32MD.lib;debug;C:/OpenSSL-Win32/lib/VC/ssleay32MDd.lib;C:/OpenSSL-Win32/lib/VC/libeay32MDd.lib
6> – Found OpenSSL headers: C:/OpenSSL-Win32/include
8>CUSTOMBUILD : CMake error : Cannot restore timestamp C:builddepg3dliteCMakeFilesgenerate.stamp
7>CUSTOMBUILD : CMake error : Cannot restore timestamp C:buildsrcservergameCMakeFilesgenerate.stamp
7> – Detected 32-bit platform
9>CUSTOMBUILD : CMake error : Cannot restore timestamp C:buildsrcserversharedCMakeFilesgenerate.stamp
9> – Detected 32-bit platform
8> – Detected 32-bit platform
6>
7> – Using supplied MySQL sources
7> – MSVC: Enabled large address awareness
7> – MSVC: Enabled SSE2 support
7> – MSVC: Overloaded standard names
7> – MSVC: Disabled NON-SECURE warnings
7> – MSVC: Disabled POSIX warnings
6> * TrinityCore revision : unknown 1970-01-01 00:00:00 +0000 (Archived branch)
6>
6> * Install core to : C:/Program Files (x86)/TrinityCore
6>
6> * Build world/auth : Yes (default)
6> * Build with scripts : Yes (default)
6> * Build map/vmap tools : No (default)
6> * Build core w/PCH : Yes (default)
6> * Build scripts w/PCH : Yes (default)
6> * Show compile-warnings : No (default)
6> * Use coreside debug : Yes
6> * Use MySQL sourcetree : Yes (default)
6> * Use GIT revision hash : No
6>
6> *** WITHOUT_GIT - WARNING!
6> *** By choosing the WITHOUT_GIT option you have waived all rights for support,
6> *** and accept that or all requests for support or assistance sent to the core
6> *** developers will be rejected. This due to that we will be unable to detect
6> *** what revision of the codebase you are using in a proper way.
6> *** We remind you that you need to use the repository codebase and a supported
6> *** version of git for the revision-hash to work, and be allowede to ask for
6> *** support if needed.
6>
6> – MySQL 5.5.9
8> – Using supplied MySQL sources
8> – MSVC: Enabled large address awareness
8> – MSVC: Enabled SSE2 support
8> – MSVC: Overloaded standard names
8> – MSVC: Disabled NON-SECURE warnings
8> – MSVC: Disabled POSIX warnings
8> – MSVC: Disabled generic compiletime warnings
8> – Found OpenSSL library: optimized;C:/OpenSSL-Win32/lib/VC/ssleay32MD.lib;C:/OpenSSL-Win32/lib/VC/libeay32MD.lib;debug;C:/OpenSSL-Win32/lib/VC/ssleay32MDd.lib;C:/OpenSSL-Win32/lib/VC/libeay32MDd.lib
8> – Found OpenSSL headers: C:/OpenSSL-Win32/include
8>
8> * TrinityCore revision : unknown 1970-01-01 00:00:00 +0000 (Archived branch)
8>
9> – Using supplied MySQL sources
9> – MSVC: Enabled large address awareness
9> – MSVC: Enabled SSE2 support
9> – MSVC: Overloaded standard names
9> – MSVC: Disabled NON-SECURE warnings
9> – MSVC: Disabled POSIX warnings
9> – MSVC: Disabled generic compiletime warnings
9> – Found OpenSSL library: optimized;C:/OpenSSL-Win32/lib/VC/ssleay32MD.lib;C:/OpenSSL-Win32/lib/VC/libeay32MD.lib;debug;C:/OpenSSL-Win32/lib/VC/ssleay32MDd.lib;C:/OpenSSL-Win32/lib/VC/libeay32MDd.lib
9> – Found OpenSSL headers: C:/OpenSSL-Win32/include
9>
9> * TrinityCore revision : unknown 1970-01-01 00:00:00 +0000 (Archived branch)
9>
9> * Install core to : C:/Program Files (x86)/TrinityCore
9>
9> * Build world/auth : Yes (default)
9> * Build with scripts : Yes (default)
9> * Build map/vmap tools : No (default)
9> * Build core w/PCH : Yes (default)
9> * Build scripts w/PCH : Yes (default)
9> * Show compile-warnings : No (default)
9> * Use coreside debug : Yes
9> * Use MySQL sourcetree : Yes (default)
9> * Use GIT revision hash : No
9>
9> *** WITHOUT_GIT - WARNING!
9> *** By choosing the WITHOUT_GIT option you have waived all rights for support,
9> *** and accept that or all requests for support or assistance sent to the core
9> *** developers will be rejected. This due to that we will be unable to detect
9> *** what revision of the codebase you are using in a proper way.
9> *** We remind you that you need to use the repository codebase and a supported
9> *** version of git for the revision-hash to work, and be allowede to ask for
9> *** support if needed.
9>
7> – MSVC: Disabled generic compiletime warnings
7> – Found OpenSSL library: optimized;C:/OpenSSL-Win32/lib/VC/ssleay32MD.lib;C:/OpenSSL-Win32/lib/VC/libeay32MD.lib;debug;C:/OpenSSL-Win32/lib/VC/ssleay32MDd.lib;C:/OpenSSL-Win32/lib/VC/libeay32MDd.lib
7> – Found OpenSSL headers: C:/OpenSSL-Win32/include
7>
7> * TrinityCore revision : unknown 1970-01-01 00:00:00 +0000 (Archived branch)
8> * Install core to : C:/Program Files (x86)/TrinityCore
9> – MySQL 5.5.9
8>
8> * Build world/auth : Yes (default)
8> * Build with scripts : Yes (default)
7>
7> * Install core to : C:/Program Files (x86)/TrinityCore
8> * Build map/vmap tools : No (default)
8> * Build core w/PCH : Yes (default)
8> * Build scripts w/PCH : Yes (default)
8> * Show compile-warnings : No (default)
8> * Use coreside debug : Yes
8> * Use MySQL sourcetree : Yes (default)
8> * Use GIT revision hash : No
8>
8> *** WITHOUT_GIT - WARNING!
8> *** By choosing the WITHOUT_GIT option you have waived all rights for support,
8> *** and accept that or all requests for support or assistance sent to the core
8> *** developers will be rejected. This due to that we will be unable to detect
8> *** what revision of the codebase you are using in a proper way.
8> *** We remind you that you need to use the repository codebase and a supported
8> *** version of git for the revision-hash to work, and be allowede to ask for
8> *** support if needed.
8>
8> – MySQL 5.5.9
7>
7> * Build world/auth : Yes (default)
7> * Build with scripts : Yes (default)
7> * Build map/vmap tools : No (default)
6> – SCRIPT PREPARATIONS
6> → Prepared: Spells
6> → Prepared: Commands
7> * Build core w/PCH : Yes (default)
8> – SCRIPT PREPARATIONS
9> – SCRIPT PREPARATIONS
6> → Prepared: Examples
8> – SCRIPT PREPARATION COMPLETE
6> → Prepared: Custom
8> → Prepared: Spells
6> → Prepared: World
8> → Prepared: Commands
8> → Prepared: Examples
6> → Prepared: Outdoor PVP Zones
6> → Prepared: Eastern Kingdoms
8> → Prepared: Custom
8> → Prepared: World
6> → Prepared: Kalimdor
6> → Prepared: Outland
8> → Prepared: Outdoor PVP Zones
8> → Prepared: Eastern Kingdoms
6> → Prepared: Northrend
6> → Prepared: Events
8> → Prepared: Kalimdor
8> → Prepared: Outland
6> → Prepared: Pet
6>
8> → Prepared: Northrend
8> → Prepared: Events
6> – SCRIPT PREPARATION COMPLETE
8> → Prepared: Pet
8>
7> * Build scripts w/PCH : Yes (default)
7> * Show compile-warnings : No (default)
7> * Use coreside debug : Yes
7> * Use MySQL sourcetree : Yes (default)
7> * Use GIT revision hash : No
7>
7> *** WITHOUT_GIT - WARNING!
6> – Configuring incomplete, errors occurred!
7> *** By choosing the WITHOUT_GIT option you have waived all rights for support,
7> *** and accept that or all requests for support or assistance sent to the core
7> *** developers will be rejected. This due to that we will be unable to detect
7> *** what revision of the codebase you are using in a proper way.
7> *** We remind you that you need to use the repository codebase and a supported
7> *** version of git for the revision-hash to work, and be allowede to ask for
7> *** support if needed.
7>
7> – MySQL 5.5.9
6> See also “C:/build/CMakeFiles/CMakeOutput.log”.
6> See also “C:/build/CMakeFiles/CMakeError.log”.
6>CUSTOMBUILD : CMake error : Unable to open check cache file for write. C:/build/CMakeFiles/cmake.check_cache
8> – Configuring incomplete, errors occurred!
8> See also “C:/build/CMakeFiles/CMakeOutput.log”.
8> See also “C:/build/CMakeFiles/CMakeError.log”.
8>CUSTOMBUILD : CMake error : Unable to open check cache file for write. C:/build/CMakeFiles/cmake.check_cache
9> → Prepared: Spells
9> → Prepared: Commands
9> → Prepared: Examples
9> → Prepared: Custom
9> → Prepared: World
9> → Prepared: Outdoor PVP Zones
9> → Prepared: Eastern Kingdoms
9> → Prepared: Kalimdor
9> → Prepared: Outland
9> → Prepared: Northrend
9> → Prepared: Events
9> → Prepared: Pet
9> – SCRIPT PREPARATION COMPLETE
9>
9> – Configuring incomplete, errors occurred!
9> See also “C:/build/CMakeFiles/CMakeOutput.log”.
9> See also “C:/build/CMakeFiles/CMakeError.log”.
9>CUSTOMBUILD : CMake error : Unable to open check cache file for write. C:/build/CMakeFiles/cmake.check_cache
7> – SCRIPT PREPARATIONS
10>------ Début de la génération : Projet : Detour, Configuration : Release Win32 ------
7> → Prepared: Spells
7> → Prepared: Commands
7> → Prepared: Examples
7> → Prepared: Custom
7> → Prepared: World
7> → Prepared: Outdoor PVP Zones
7> → Prepared: Eastern Kingdoms
7> → Prepared: Kalimdor
7> → Prepared: Outland
7> → Prepared: Northrend
7> → Prepared: Events
7> → Prepared: Pet
7> – SCRIPT PREPARATION COMPLETE
7>
11>------ Début de la génération : Projet : collision, Configuration : Release Win32 ------
7> – Configuring incomplete, errors occurred!
7> See also “C:/build/CMakeFiles/CMakeOutput.log”.
7> See also “C:/build/CMakeFiles/CMakeError.log”.
7>CUSTOMBUILD : CMake error : Unable to open check cache file for write. C:/build/CMakeFiles/cmake.check_cache
10> Building Custom Rule C:/Trinity/dep/recastnavigation/Detour/CMakeLists.txt
12>------ Début de la génération : Projet : libmysql, Configuration : Release Win32 ------
11> Building Custom Rule C:/Trinity/src/server/collision/CMakeLists.txt
12> Building Custom Rule C:/Trinity/dep/mysqllite/CMakeLists.txt
13>------ Début de la génération : Projet : Recast, Configuration : Release Win32 ------
13> Building Custom Rule C:/Trinity/dep/recastnavigation/Recast/CMakeLists.txt
10>CUSTOMBUILD : CMake error : Cannot restore timestamp C:builddeprecastnavigationDetourCMakeFilesgenerate.stamp
11>CUSTOMBUILD : CMake error : Cannot restore timestamp C:buildsrcservercollisionCMakeFilesgenerate.stamp
10> – Detected 32-bit platform
10> – Using supplied MySQL sources
10> – MSVC: Enabled large address awareness
10> – MSVC: Enabled SSE2 support
10> – MSVC: Overloaded standard names
10> – MSVC: Disabled NON-SECURE warnings
10> – MSVC: Disabled POSIX warnings
10> – MSVC: Disabled generic compiletime warnings
10> – Found OpenSSL library: optimized;C:/OpenSSL-Win32/lib/VC/ssleay32MD.lib;C:/OpenSSL-Win32/lib/VC/libeay32MD.lib;debug;C:/OpenSSL-Win32/lib/VC/ssleay32MDd.lib;C:/OpenSSL-Win32/lib/VC/libeay32MDd.lib
10> – Found OpenSSL headers: C:/OpenSSL-Win32/include
12>CUSTOMBUILD : CMake error : Cannot restore timestamp C:builddepmysqlliteCMakeFilesgenerate.stamp
11> – Detected 32-bit platform
10>
11> – Using supplied MySQL sources
10> * TrinityCore revision : unknown 1970-01-01 00:00:00 +0000 (Archived branch)
11> – MSVC: Enabled large address awareness
11> – MSVC: Enabled SSE2 support
11> – MSVC: Overloaded standard names
11> – MSVC: Disabled NON-SECURE warnings
11> – MSVC: Disabled POSIX warnings
11> – MSVC: Disabled generic compiletime warnings
10>
10> * Install core to : C:/Program Files (x86)/TrinityCore
10>
10> * Build world/auth : Yes (default)
10> * Build with scripts : Yes (default)
10> * Build map/vmap tools : No (default)
10> * Build core w/PCH : Yes (default)
10> * Build scripts w/PCH : Yes (default)
10> * Show compile-warnings : No (default)
10> * Use coreside debug : Yes
10> * Use MySQL sourcetree : Yes (default)
10> * Use GIT revision hash : No
10>
10> *** WITHOUT_GIT - WARNING!
10> *** By choosing the WITHOUT_GIT option you have waived all rights for support,
10> *** and accept that or all requests for support or assistance sent to the core
10> *** developers will be rejected. This due to that we will be unable to detect
10> *** what revision of the codebase you are using in a proper way.
10> *** We remind you that you need to use the repository codebase and a supported
10> *** version of git for the revision-hash to work, and be allowede to ask for
10> *** support if needed.
10>
11> – Found OpenSSL library: optimized;C:/OpenSSL-Win32/lib/VC/ssleay32MD.lib;C:/OpenSSL-Win32/lib/VC/libeay32MD.lib;debug;C:/OpenSSL-Win32/lib/VC/ssleay32MDd.lib;C:/OpenSSL-Win32/lib/VC/libeay32MDd.lib
11> – Found OpenSSL headers: C:/OpenSSL-Win32/include
12> – Detected 32-bit platform
12> – Using supplied MySQL sources
12> – MSVC: Enabled large address awareness
12> – MSVC: Enabled SSE2 support
12> – MSVC: Overloaded standard names
12> – MSVC: Disabled NON-SECURE warnings
12> – MSVC: Disabled POSIX warnings
12> – MSVC: Disabled generic compiletime warnings
12> – Found OpenSSL library: optimized;C:/OpenSSL-Win32/lib/VC/ssleay32MD.lib;C:/OpenSSL-Win32/lib/VC/libeay32MD.lib;debug;C:/OpenSSL-Win32/lib/VC/ssleay32MDd.lib;C:/OpenSSL-Win32/lib/VC/libeay32MDd.lib
12> – Found OpenSSL headers: C:/OpenSSL-Win32/include
11>
11> * TrinityCore revision : unknown 1970-01-01 00:00:00 +0000 (Archived branch)
11>
11> * Install core to : C:/Program Files (x86)/TrinityCore
11>
11> * Build world/auth : Yes (default)
11> * Build with scripts : Yes (default)
11> * Build map/vmap tools : No (default)
11> * Build core w/PCH : Yes (default)
11> * Build scripts w/PCH : Yes (default)
11> * Show compile-warnings : No (default)
11> * Use coreside debug : Yes
11> * Use MySQL sourcetree : Yes (default)
11> * Use GIT revision hash : No
11>
11> *** WITHOUT_GIT - WARNING!
11> *** By choosing the WITHOUT_GIT option you have waived all rights for support,
11> *** and accept that or all requests for support or assistance sent to the core
11> *** developers will be rejected. This due to that we will be unable to detect
11> *** what revision of the codebase you are using in a proper way.
11> *** We remind you that you need to use the repository codebase and a supported
11> *** version of git for the revision-hash to work, and be allowede to ask for
11> *** support if needed.
11>
12>
12> * TrinityCore revision : unknown 1970-01-01 00:00:00 +0000 (Archived branch)
12>
12> * Install core to : C:/Program Files (x86)/TrinityCore
12>
12> * Build world/auth : Yes (default)
12> * Build with scripts : Yes (default)
12> * Build map/vmap tools : No (default)
12> * Build core w/PCH : Yes (default)
12> * Build scripts w/PCH : Yes (default)
12> * Show compile-warnings : No (default)
12> * Use coreside debug : Yes
12> * Use MySQL sourcetree : Yes (default)
12> * Use GIT revision hash : No
12>
12> *** WITHOUT_GIT - WARNING!
12> *** By choosing the WITHOUT_GIT option you have waived all rights for support,
12> *** and accept that or all requests for support or assistance sent to the core
12> *** developers will be rejected. This due to that we will be unable to detect
12> *** what revision of the codebase you are using in a proper way.
12> *** We remind you that you need to use the repository codebase and a supported
12> *** version of git for the revision-hash to work, and be allowede to ask for
12> *** support if needed.
12>
10> – MySQL 5.5.9
13>CUSTOMBUILD : CMake error : Cannot restore timestamp C:builddeprecastnavigationRecastCMakeFilesgenerate.stamp
11> – MySQL 5.5.9
12> – MySQL 5.5.9
13> – Detected 32-bit platform
13> – Using supplied MySQL sources
11> – SCRIPT PREPARATIONS
10> – SCRIPT PREPARATIONS
13> – MSVC: Enabled large address awareness
13> – MSVC: Enabled SSE2 support
13> – MSVC: Overloaded standard names
11> → Prepared: Spells
10> – SCRIPT PREPARATION COMPLETE
10> → Prepared: Spells
10> → Prepared: Commands
10> → Prepared: Examples
10> → Prepared: Custom
10> → Prepared: World
10> → Prepared: Outdoor PVP Zones
10> → Prepared: Eastern Kingdoms
10> → Prepared: Kalimdor
10> → Prepared: Outland
10> → Prepared: Northrend
10> → Prepared: Events
10> → Prepared: Pet
10>
11> → Prepared: Commands
11> → Prepared: Examples
11> → Prepared: Custom
11> → Prepared: World
11> → Prepared: Outdoor PVP Zones
13> – MSVC: Disabled NON-SECURE warnings
13> – MSVC: Disabled POSIX warnings
13> – MSVC: Disabled generic compiletime warnings
13> – Found OpenSSL library: optimized;C:/OpenSSL-Win32/lib/VC/ssleay32MD.lib;C:/OpenSSL-Win32/lib/VC/libeay32MD.lib;debug;C:/OpenSSL-Win32/lib/VC/ssleay32MDd.lib;C:/OpenSSL-Win32/lib/VC/libeay32MDd.lib
13> – Found OpenSSL headers: C:/OpenSSL-Win32/include
10> – Configuring incomplete, errors occurred!
13>
13> * TrinityCore revision : unknown 1970-01-01 00:00:00 +0000 (Archived branch)
13>
13> * Install core to : C:/Program Files (x86)/TrinityCore
13>
13> * Build world/auth : Yes (default)
13> * Build with scripts : Yes (default)
13> * Build map/vmap tools : No (default)
13> * Build core w/PCH : Yes (default)
13> * Build scripts w/PCH : Yes (default)
13> * Show compile-warnings : No (default)
13> * Use coreside debug : Yes
13> * Use MySQL sourcetree : Yes (default)
13> * Use GIT revision hash : No
13>
13> *** WITHOUT_GIT - WARNING!
13> *** By choosing the WITHOUT_GIT option you have waived all rights for support,
11> → Prepared: Eastern Kingdoms
10> See also “C:/build/CMakeFiles/CMakeOutput.log”.
10> See also “C:/build/CMakeFiles/CMakeError.log”.
10>CUSTOMBUILD : CMake error : Unable to open check cache file for write. C:/build/CMakeFiles/cmake.check_cache
11> → Prepared: Kalimdor
13> *** and accept that or all requests for support or assistance sent to the core
12> – SCRIPT PREPARATIONS
12> → Prepared: Spells
12> → Prepared: Commands
12> → Prepared: Examples
12> → Prepared: Custom
12> → Prepared: World
12> → Prepared: Outdoor PVP Zones
12> → Prepared: Eastern Kingdoms
12> → Prepared: Kalimdor
12> → Prepared: Outland
12> → Prepared: Northrend
12> → Prepared: Events
12> → Prepared: Pet
12> – SCRIPT PREPARATION COMPLETE
12>
13> *** developers will be rejected. This due to that we will be unable to detect
13> *** what revision of the codebase you are using in a proper way.
13> *** We remind you that you need to use the repository codebase and a supported
13> *** version of git for the revision-hash to work, and be allowede to ask for
13> *** support if needed.
13>
13> – MySQL 5.5.9
13> – SCRIPT PREPARATIONS
13> → Prepared: Spells
13> → Prepared: Commands
13> → Prepared: Examples
13> → Prepared: Custom
13> → Prepared: World
13> → Prepared: Outdoor PVP Zones
13> → Prepared: Eastern Kingdoms
13> → Prepared: Kalimdor
13> → Prepared: Outland
13> → Prepared: Northrend
13> → Prepared: Events
13> → Prepared: Pet
13> – SCRIPT PREPARATION COMPLETE
13>
11> → Prepared: Outland
11> → Prepared: Northrend
11> → Prepared: Events
11> – SCRIPT PREPARATION COMPLETE
11> → Prepared: Pet
11>
11> – Configuring incomplete, errors occurred!
11> See also “C:/build/CMakeFiles/CMakeOutput.log”.
11> See also “C:/build/CMakeFiles/CMakeError.log”.
11>CUSTOMBUILD : CMake error : Unable to open check cache file for write. C:/build/CMakeFiles/cmake.check_cache
12> – Configuring incomplete, errors occurred!
13> – Configuring incomplete, errors occurred!
13> See also “C:/build/CMakeFiles/CMakeOutput.log”.
13> See also “C:/build/CMakeFiles/CMakeError.log”.
13>CUSTOMBUILD : CMake error : Unable to open check cache file for write. C:/build/CMakeFiles/cmake.check_cache
12> See also “C:/build/CMakeFiles/CMakeOutput.log”.
12> See also “C:/build/CMakeFiles/CMakeError.log”.
12>CUSTOMBUILD : CMake error : Unable to open check cache file for write. C:/build/CMakeFiles/cmake.check_cache
14>------ Début de la génération : Projet : worldserver, Configuration : Release Win32 ------
15>------ Début de la génération : Projet : authserver, Configuration : Release Win32 ------
14> Building Custom Rule C:/Trinity/src/server/worldserver/CMakeLists.txt
14>CUSTOMBUILD : CMake error : Cannot restore timestamp C:buildsrcserverworldserverCMakeFilesgenerate.stamp
14> – Detected 32-bit platform
14> – Using supplied MySQL sources
14> – MSVC: Enabled large address awareness
14> – MSVC: Enabled SSE2 support
14> – MSVC: Overloaded standard names
14> – MSVC: Disabled NON-SECURE warnings
14> – MSVC: Disabled POSIX warnings
14> – MSVC: Disabled generic compiletime warnings
14> – Found OpenSSL library: optimized;C:/OpenSSL-Win32/lib/VC/ssleay32MD.lib;C:/OpenSSL-Win32/lib/VC/libeay32MD.lib;debug;C:/OpenSSL-Win32/lib/VC/ssleay32MDd.lib;C:/OpenSSL-Win32/lib/VC/libeay32MDd.lib
14> – Found OpenSSL headers: C:/OpenSSL-Win32/include
14>
14> * TrinityCore revision : unknown 1970-01-01 00:00:00 +0000 (Archived branch)
14>
14> * Install core to : C:/Program Files (x86)/TrinityCore
14>
14> * Build world/auth : Yes (default)
14> * Build with scripts : Yes (default)
14> * Build map/vmap tools : No (default)
14> * Build core w/PCH : Yes (default)
14> * Build scripts w/PCH : Yes (default)
14> * Show compile-warnings : No (default)
14> * Use coreside debug : Yes
14> * Use MySQL sourcetree : Yes (default)
14> * Use GIT revision hash : No
14>
14> *** WITHOUT_GIT - WARNING!
14> *** By choosing the WITHOUT_GIT option you have waived all rights for support,
14> *** and accept that or all requests for support or assistance sent to the core
14> *** developers will be rejected. This due to that we will be unable to detect
14> *** what revision of the codebase you are using in a proper way.
14> *** We remind you that you need to use the repository codebase and a supported
14> *** version of git for the revision-hash to work, and be allowede to ask for
14> *** support if needed.
14>
14> – MySQL 5.5.9
14> – SCRIPT PREPARATIONS
14> → Prepared: Spells
14> → Prepared: Commands
14> → Prepared: Examples
14> → Prepared: Custom
14> → Prepared: World
14> → Prepared: Outdoor PVP Zones
14> → Prepared: Eastern Kingdoms
14> → Prepared: Kalimdor
14> → Prepared: Outland
14> → Prepared: Northrend
14> → Prepared: Events
14> → Prepared: Pet
14> – SCRIPT PREPARATION COMPLETE
14>
14> – Configuring incomplete, errors occurred!
14> See also “C:/build/CMakeFiles/CMakeOutput.log”.
14> See also “C:/build/CMakeFiles/CMakeError.log”.
14>CUSTOMBUILD : CMake error : Unable to open check cache file for write. C:/build/CMakeFiles/cmake.check_cache
16>------ Début de la génération : Projet : ALL_BUILD, Configuration : Release Win32 ------
16> Building Custom Rule C:/Trinity/CMakeLists.txt
16>CUSTOMBUILD : CMake error : Cannot restore timestamp C:buildCMakeFilesgenerate.stamp
16> – Detected 32-bit platform
16> – Using supplied MySQL sources
16> – MSVC: Enabled large address awareness
16> – MSVC: Enabled SSE2 support
16> – MSVC: Overloaded standard names
16> – MSVC: Disabled NON-SECURE warnings
16> – MSVC: Disabled POSIX warnings
16> – MSVC: Disabled generic compiletime warnings
16> – Found OpenSSL library: optimized;C:/OpenSSL-Win32/lib/VC/ssleay32MD.lib;C:/OpenSSL-Win32/lib/VC/libeay32MD.lib;debug;C:/OpenSSL-Win32/lib/VC/ssleay32MDd.lib;C:/OpenSSL-Win32/lib/VC/libeay32MDd.lib
16> – Found OpenSSL headers: C:/OpenSSL-Win32/include
16>
16> * TrinityCore revision : unknown 1970-01-01 00:00:00 +0000 (Archived branch)
16>
16> * Install core to : C:/Program Files (x86)/TrinityCore
16>
16> * Build world/auth : Yes (default)
16> * Build with scripts : Yes (default)
16> * Build map/vmap tools : No (default)
16> * Build core w/PCH : Yes (default)
16> * Build scripts w/PCH : Yes (default)
16> * Show compile-warnings : No (default)
16> * Use coreside debug : Yes
16> * Use MySQL sourcetree : Yes (default)
16> * Use GIT revision hash : No
16>
16> *** WITHOUT_GIT - WARNING!
16> *** By choosing the WITHOUT_GIT option you have waived all rights for support,
16> *** and accept that or all requests for support or assistance sent to the core
16> *** developers will be rejected. This due to that we will be unable to detect
16> *** what revision of the codebase you are using in a proper way.
16> *** We remind you that you need to use the repository codebase and a supported
16> *** version of git for the revision-hash to work, and be allowede to ask for
16> *** support if needed.
16>
16> – MySQL 5.5.9
16> – SCRIPT PREPARATIONS
16> → Prepared: Spells
16> → Prepared: Commands
16> → Prepared: Examples
16> → Prepared: Custom
16> → Prepared: World
16> → Prepared: Outdoor PVP Zones
16> → Prepared: Eastern Kingdoms
16> → Prepared: Kalimdor
16> → Prepared: Outland
16> → Prepared: Northrend
16> → Prepared: Events
16> – SCRIPT PREPARATION COMPLETE
16> → Prepared: Pet
16>
16> – Configuring incomplete, errors occurred!
16> See also “C:/build/CMakeFiles/CMakeOutput.log”.
16> See also “C:/build/CMakeFiles/CMakeError.log”.
16>CUSTOMBUILD : CMake error : Unable to open check cache file for write. C:/build/CMakeFiles/cmake.check_cache
========== Génération : 0 a réussi, 16 a échoué, 0 mis à jour, 0 a été ignoré ==========

merci de votre aide.

Config cmake incomplête.

Tu n’as pas bien configurer Cmake, il faut bien tout cocher